Target
Receptor-type tyrosine-protein phosphatase C
Ligand
BDBM50335865
Substrate
Meas. Tech.
ChEMBL_715352 (CHEMBL1664681)
IC50
410±n/a nM
Citation
 Vang, TXie, YLiu, WHVidovic, DLiu, YWu, SSmith, DHRinderspacher, AChung, CGong, GMustelin, TLandry, DWRickert, RCSchürer, SCDeng, SXTautz, L Inhibition of lymphoid tyrosine phosphatase by benzofuran salicylic acids. J Med Chem 54:562-71 (2011)  
Target
Name:
Receptor-type tyrosine-protein phosphatase C
Synonyms:
CD45 L-CA PTPRC Receptor-type tyrosine-protein phosphatase C (CD45) | T200
Type:
Protein
Mol. Mass.:
147474.19
Organism:
Homo sapiens (Human)
Description:
P08575
Residue:
1306
  
Inhibitor
Name:
BDBM50335865
Synonyms:
6-Hydroxy-2-(4-methoxyphenyl)-3-(1-(4-(naphthalen-1-ylamino)-4-oxobutyl)-1H-1,2,3-triazol-4-yl)benzofuran-5-carboxylic Acid | CHEMBL1650889
Type:
Small organic molecule
Emp. Form.:
C32H26N4O6
Mol. Mass.:
562.572
SMILES:
COc1ccc(cc1)-c1oc2cc(O)c(cc2c1-c1cn(CCCC(=O)Nc2cccc3ccccc23)nn1)C(O)=O
: