Target
Cannabinoid receptor 2
Ligand
BDBM21301
Substrate
Meas. Tech.
ChEMBL_717853 (CHEMBL1670561)
Ki
0.1±n/a nM
Citation
 Brogi, SCorelli, FDi Marzo, VLigresti, AMugnaini, CPasquini, STafi, A Three-dimensional quantitative structure-selectivity relationships analysis guided rational design of a highly selective ligand for the cannabinoid receptor 2. Eur J Med Chem 46:547-55 (2011)  
Target
Name:
Cannabinoid receptor 2
Synonyms:
CANNABINOID CB2 CB2 CB2B CNR2_HUMAN Cannabinoid CB2 receptor Cannabinoid receptor 2 (CB2R) | hCB2
Type:
G Protein-Coupled Receptor (GPCR)
Mol. Mass.:
39690.94
Organism:
Homo sapiens (Human)
Description:
P34972
Residue:
360
  
Inhibitor
Name:
BDBM21301
Synonyms:
7-methoxy-1-(oxan-4-ylmethyl)-3-[(2,2,3,3-tetramethylcyclopropyl)carbonyl]-1H-indole | Tetrahydropyranyl-methyl analogue, 22
Type:
Small organic molecule
Emp. Form.:
C23H31NO3
Mol. Mass.:
369.4971
SMILES:
COc1cccc2c(cn(CC3CCOCC3)c12)C(=O)C1C(C)(C)C1(C)C
: