Target
Gamma-aminobutyric acid receptor subunit rho-1
Ligand
BDBM50032982
Substrate
Meas. Tech.
ChEMBL_718201 (CHEMBL1679247)
IC50
62000±n/a nM
Citation
 Gavande, NYamamoto, ISalam, NKAi, THBurden, PMJohnston, GAHanrahan, JR Novel Cyclic Phosphinic Acids as GABAC ρ Receptor Antagonists: Design, Synthesis, and Pharmacology ACS Med Chem Lett 2:11-16 (2011)  
Target
Name:
Gamma-aminobutyric acid receptor subunit rho-1
Synonyms:
GABA receptor rho-1 subunit GABRR1 | GBRR1_HUMAN
Type:
PROTEIN
Mol. Mass.:
55892.34
Organism:
Homo sapiens (Human)
Description:
ChEMBL_1456653
Residue:
479
  
Inhibitor
Name:
BDBM50032982
Synonyms:
(3-Amino-propyl)-butyl-phosphinic acid CGP36742 | CHEMBL112797
Type:
Small organic molecule
Emp. Form.:
C7H18NO2P
Mol. Mass.:
179.1971
SMILES:
CCCCP(O)(=O)CCCN
: