Target
Methylated-DNA--protein-cysteine methyltransferase
Ligand
BDBM50338477
Substrate
Meas. Tech.
ChEMBL_728308 (CHEMBL1687568)
IC50
320±n/a nM
Citation
 Lopez, SMargison, GPMcElhinney, RSCordeiro, AMcMurry, TBRozas, I Towards more specific O6-methylguanine-DNA methyltransferase (MGMT) inactivators. Bioorg Med Chem 19:1658-65 (2011)  
Target
Name:
Methylated-DNA--protein-cysteine methyltransferase
Synonyms:
6-O-methylguanine-DNA methyltransferase MGMT_HUMAN
Type:
PROTEIN
Mol. Mass.:
21651.27
Organism:
Homo sapiens (Human)
Description:
ChEMBL_144711
Residue:
207
  
Inhibitor
Name:
BDBM50338477
Synonyms:
6-((4-bromothiophen-2-yl)methoxy)-5-nitropyrimidine-2,4-diamine | CHEMBL1683172
Type:
Small organic molecule
Emp. Form.:
C9H8BrN5O3S
Mol. Mass.:
346.161
SMILES:
Nc1nc(N)c(c(OCc2cc(Br)cs2)n1)[N+]([O-])=O
: