Target
Carbonic anhydrase
Ligand
BDBM26187
Substrate
Meas. Tech.
ChEMBL_736725 (CHEMBL1695106)
Ki
25900±n/a nM
Citation
 Davis, RAHofmann, AOsman, AHall, RAMühlschlegel, FAVullo, DInnocenti, ASupuran, CTPoulsen, SA Natural product-based phenols as novel probes for mycobacterial and fungal carbonic anhydrases. J Med Chem 54:1682-92 (2011)  
Target
Name:
Carbonic anhydrase
Synonyms:
Carbonic Anhydrase 2 (Can2)
Type:
Enzyme
Mol. Mass.:
26594.37
Organism:
Cryptococcus neoformans var. grubii (Filobasidiella neoformans var. grubii)
Description:
Residue:
239
  
Inhibitor
Name:
BDBM26187
Synonyms:
α-CA inhibitor, 11 US9688816, 2 | phenol
Type:
Small organic molecule
Emp. Form.:
C6H6O
Mol. Mass.:
94.1112
SMILES:
Oc1ccccc1
: