Target
11-beta-hydroxysteroid dehydrogenase type 2
Ligand
BDBM50233538
Substrate
Meas. Tech.
ChEMBL_735659 (CHEMBL1693474)
IC50
360±n/a nM
Citation
 Gaware, RKhunt, RCzollner, LStanetty, CDa Cunha, TKratschmar, DVOdermatt, AKosma, PJordis, UClassen-Houben, D Synthesis of new glycyrrhetinic acid derived ring A azepanone, 29-urea and 29-hydroxamic acid derivatives as selective 11ß-hydroxysteroid dehydrogenase 2 inhibitors. Bioorg Med Chem 19:1866-80 (2011)  
Target
Name:
11-beta-hydroxysteroid dehydrogenase type 2
Synonyms:
11-beta-hydroxysteroid dehydrogenase 2 Hsd11b2 | Hsd11k
Type:
PROTEIN
Mol. Mass.:
43740.05
Organism:
Rattus norvegicus
Description:
ChEMBL_735659
Residue:
400
  
Inhibitor
Name:
BDBM50233538
Synonyms:
18beta-glycyrrhetic acid CHEMBL230006 glycyrrhetinic acid
Type:
Small organic molecule
Emp. Form.:
C30H46O4
Mol. Mass.:
470.6838
SMILES:
CC1(C)[C@@H](O)CC[C@@]2(C)[C@H]1CC[C@]1(C)[C@@H]2C(=O)C=C2[C@@H]3C[C@](C)(CC[C@]3(C)CC[C@@]12C)C(O)=O
: