Target
Polyphenol oxidase 2
Ligand
BDBM50339940
Substrate
Meas. Tech.
ChEMBL_739668 (CHEMBL1763494)
Ki
673±n/a nM
Citation
 Ha, YMPark, JYPark, YJPark, DChoi, YJKim, JMLee, EKHan, YKKim, JALee, JYMoon, HRChung, HY Synthesis and biological activity of hydroxy substituted phenyl-benzo[d]thiazole analogues for antityrosinase activity in B16 cells. Bioorg Med Chem Lett 21:2445-9 (2011)  
Target
Name:
Polyphenol oxidase 2
Synonyms:
Monophenol monooxygenase PPO2 Tyrosinase
Type:
Protein
Mol. Mass.:
63923.66
Organism:
Agaricus bisporus (Common mushroom)
Description:
O42713
Residue:
556
  
Inhibitor
Name:
BDBM50339940
Synonyms:
4-(Benzo[d]thiazol-2-yl)benzene-1,3-diol | CHEMBL1408767
Type:
Small organic molecule
Emp. Form.:
C13H9NO2S
Mol. Mass.:
243.281
SMILES:
Oc1ccc(-c2nc3ccccc3s2)c(O)c1
: