Target
11-beta-hydroxysteroid dehydrogenase type 2
Ligand
BDBM50340800
Substrate
Meas. Tech.
ChEMBL_740566 (CHEMBL1764829)
IC50
>4000±n/a nM
Citation
 Sun, WMaletic, MMundt, SSShah, KZokian, HLyons, KWaddell, STBalkovec, J Substituted phenyl triazoles as selective inhibitors of 11 β-Hydroxysteroid Dehydrogenase Type 1. Bioorg Med Chem Lett 21:2141-5 (2011)  
Target
Name:
11-beta-hydroxysteroid dehydrogenase type 2
Synonyms:
11-DH2 11-beta-Hydroxysteroid Dehydrogenase 2 (11-beta-HSD2) Corticosteroid 11-beta-dehydrogenase isozyme 2 Hsd11b2 NAD-dependent 11-beta-hydroxysteroid dehydrogenase
Type:
Enzyme
Mol. Mass.:
42201.46
Organism:
Mus musculus (mouse)
Description:
Purified recombinant mouse 11beta-HSD2.
Residue:
386
  
Inhibitor
Name:
BDBM50340800
Synonyms:
3-(4-(5-(1-(4-chlorophenyl)cyclobutyl)-4-methyl-4H-1,2,4-triazol-3-yl)-3-methoxyphenyl)pyridine | CHEMBL1760803
Type:
Small organic molecule
Emp. Form.:
C25H23ClN4O
Mol. Mass.:
430.929
SMILES:
COc1cc(ccc1-c1nnc(n1C)C1(CCC1)c1ccc(Cl)cc1)-c1cccnc1
: