Target
Cytochrome P450 2D6
Ligand
BDBM50341448
Substrate
Meas. Tech.
ChEMBL_741719 (CHEMBL1769765)
IC50
1000±n/a nM
Citation
 Procopiou, PABrowning, CBuckley, JMClark, KLFechner, LGore, PMHancock, APHodgson, STHolmes, DSKranz, MLooker, BEMorriss, KMParton, DLRussell, LJSlack, RJSollis, SLVile, SWatts, CJ The discovery of phthalazinone-based human H1 and H3 single-ligand antagonists suitable for intranasal administration for the treatment of allergic rhinitis. J Med Chem 54:2183-95 (2011)  
Target
Name:
Cytochrome P450 2D6
Synonyms:
CP2D6_HUMAN CYP2DL1 Cytochrome P450 2D6 (CYP2D6) P450-DB1
Type:
Protein
Mol. Mass.:
55774.82
Organism:
Homo sapiens (Human)
Description:
P10635
Residue:
497
  
Inhibitor
Name:
BDBM50341448
Synonyms:
4-(4-Chloro-benzyl)-2-(1-methyl-azepan-4-yl)-2H-phthalazin-1-one Astelin CHEMBL639 Optivar US20230414632, Compound II-a | rac-Azelastine
Type:
Small organic molecule
Emp. Form.:
C22H24ClN3O
Mol. Mass.:
381.898
SMILES:
CN1CCCC(CC1)n1nc(Cc2ccc(Cl)cc2)c2ccccc2c1=O
: