Target
Fatty-acid amide hydrolase 1
Ligand
BDBM50342069
Substrate
Meas. Tech.
ChEMBL_743931 (CHEMBL1767925)
Ki
2.9±n/a nM
Citation
 Ezzili, CMileni, MMcGlinchey, NLong, JZKinsey, SGHochstatter, DGStevens, RCLichtman, AHCravatt, BFBilsky, EJBoger, DL Reversible competitivea-ketoheterocycle inhibitors of fatty acid amide hydrolase containing additional conformational constraints in the acyl side chain: orally active, long-acting analgesics. J Med Chem 54:2805-22 (2011)  
Target
Name:
Fatty-acid amide hydrolase 1
Synonyms:
Anandamide amidohydrolase FAAH FAAH1_HUMAN Fatty-acid amide hydrolase (FAAH) Oleamide hydrolase 1
Type:
Protein
Mol. Mass.:
63071.19
Organism:
Homo sapiens (Human)
Description:
O00519
Residue:
579
  
Inhibitor
Name:
BDBM50342069
Synonyms:
(S)-methyl 2-(6-(benzyloxy)-1,2,3,4-tetrahydronaphthalene-2-carbonyl)oxazole-5-carboxylate | CHEMBL1765835
Type:
Small organic molecule
Emp. Form.:
C23H21NO5
Mol. Mass.:
391.4165
SMILES:
COC(=O)c1cnc(o1)C(=O)[C@H]1CCc2cc(OCc3ccccc3)ccc2C1
: