Target
6-phosphogluconate dehydrogenase, decarboxylating
Ligand
BDBM50148767
Substrate
Meas. Tech.
ChEMBL_744988 (CHEMBL1772003)
Ki
10±n/a nM
Citation
 Yep, ASorenson, RJWilson, MRShowalter, HDLarsen, SDKeller, PRWoodard, RW Enediol mimics as inhibitors of the D-arabinose 5-phosphate isomerase (KdsD) from Francisella tularensis. Bioorg Med Chem Lett 21:2679-82 (2011)  
Target
Name:
6-phosphogluconate dehydrogenase, decarboxylating
Synonyms:
6-phosphogluconate dehydrogenase, decarboxylating, putative
Type:
PROTEIN
Mol. Mass.:
52169.87
Organism:
Trypanosoma brucei brucei (strain 927/4 GUTat10.1)
Description:
ChEMBL_744988
Residue:
479
  
Inhibitor
Name:
BDBM50148767
Synonyms:
2,3-dihydroxy-4-(hydroxyamino)-4-oxobutyl dihydrogen phosphate CHEMBL116018 | Phosphoric acid mono-((1R,3R)-2,3-dihydroxy-3-hydroxycarbamoyl-propyl) ester
Type:
Small organic molecule
Emp. Form.:
C4H10NO8P
Mol. Mass.:
231.0979
SMILES:
ONC(=O)[C@H](O)[C@H](O)COP(O)(O)=O
: