Target
Neuropeptide Y receptor type 1
Ligand
BDBM50342724
Substrate
Meas. Tech.
ChEMBL_744205 (CHEMBL1771962)
Ki
5±n/a nM
Citation
 Griffith, DAHargrove, DMMaurer, TSBlum, CADe Lombaert, SInthavongsay, JKKlade, LEMack, CMRose, CRSanders, MJCarpino, PA Discovery and evaluation of pyrazolo[1,5-a]pyrimidines as neuropeptide Y1 receptor antagonists. Bioorg Med Chem Lett 21:2641-5 (2011)  
Target
Name:
Neuropeptide Y receptor type 1
Synonyms:
NPY-Y1 NPY1R NPYR neuropeptide Y receptor Y1
Type:
Enzyme Catalytic Domain
Mol. Mass.:
44399.07
Organism:
Homo sapiens (Human)
Description:
NPY-Y1 NPY1R HUMAN::P25929
Residue:
384
  
Inhibitor
Name:
BDBM50342724
Synonyms:
CHEMBL1771264 | N1-(3-(2,6-dichloro-4-methoxyphenyl)-2,5-dimethylpyrazolo[1,5-a]pyrimidin-7-yl)-N2-(2-fluorocyclohexyl)ethane-1,2-diamine
Type:
Small organic molecule
Emp. Form.:
C23H28Cl2FN5O
Mol. Mass.:
480.406
SMILES:
COc1cc(Cl)c(-c2c(C)nn3c(NCCNC4CCCCC4F)cc(C)nc23)c(Cl)c1
: