Target
Disintegrin and metalloproteinase domain-containing protein 17
Ligand
BDBM50342973
Substrate
Meas. Tech.
ChEMBL_744255 (CHEMBL1772062)
Ki
0.400000±n/a nM
Citation
 Dai, CLi, DPopovici-Muller, JZhao, LGirijavallabhan, VMRosner, KELavey, BJRizvi, RShankar, BBWong, MKGuo, ZOrth, PStrickland, COSun, JNiu, XChen, SKozlowski, JALundell, DJPiwinski, JJShih, NYSiddiqui, MA 2-(2-Aminothiazol-4-yl)pyrrolidine-based tartrate diamides as potent, selective and orally bioavailable TACE inhibitors. Bioorg Med Chem Lett 21:3172-6 (2011)  
Target
Name:
Disintegrin and metalloproteinase domain-containing protein 17
Synonyms:
ADA17_HUMAN CSVP Disintegrin and metalloproteinase domain-containing protein 17 (ADAM17) TNF-alpha convertase TNF-alpha-converting enzyme (TACE) Tumor necrosis factor-α converting enzyme (TACE)
Type:
Enzyme
Mol. Mass.:
93007.89
Organism:
Homo sapiens (Human)
Description:
Residue:
824
  
Inhibitor
Name:
BDBM50342973
Synonyms:
(2R,3R)-N-((R)-1-(4-(1H-pyrazol-1-yl)phenyl)ethyl)-2,3-dihydroxy-4-((R)-2-methyl-2-phenylpyrrolidin-1-yl)-4-oxobutanamide | CHEMBL1770630
Type:
Small organic molecule
Emp. Form.:
C26H29ClN4O4
Mol. Mass.:
496.986
SMILES:
C[C@@H](NC(=O)[C@H](O)[C@@H](O)C(=O)N1CCC[C@]1(C)c1cccc(Cl)c1)c1ccc(cc1)-n1cccn1
: