Target
Sodium- and chloride-dependent GABA transporter 3
Ligand
BDBM18133
Substrate
Meas. Tech.
ChEMBL_745626 (CHEMBL1775996)
IC50
1348963±n/a nM
Citation
 Hack, SWörlein, BHöfner, GPabel, JWanner, KT Development of imidazole alkanoic acids as mGAT3 selective GABA uptake inhibitors. Eur J Med Chem 46:1483-98 (2011)  
Target
Name:
Sodium- and chloride-dependent GABA transporter 3
Synonyms:
GABA transporter Gabt3 Gat-4 Gat4 Slc6a11 Sodium- and chloride-dependent GABA transporter 4 | Solute carrier family 6 member 11
Type:
PROTEIN
Mol. Mass.:
69962.73
Organism:
Mus musculus
Description:
ChEMBL_1460090
Residue:
627
  
Inhibitor
Name:
BDBM18133
Synonyms:
2-aminoacetic acid Glycine | [14C]Glycine
Type:
Amino Acid
Emp. Form.:
C2H5NO2
Mol. Mass.:
75.0666
SMILES:
NCC(O)=O
: