Target
Metabotropic glutamate receptor 5
Ligand
BDBM50345572
Substrate
Meas. Tech.
ChEMBL_751567 (CHEMBL1787493)
Ki
0.2±n/a nM
Citation
 Alagille, DDaCosta, HChen, YHemstapat, KRodriguez, ABaldwin, RMConn, JPTamagnan, GD Potent mGluR5 antagonists: pyridyl and thiazolyl-ethynyl-3,5-disubstituted-phenyl series. Bioorg Med Chem Lett 21:3243-7 (2011)  
Target
Name:
Metabotropic glutamate receptor 5
Synonyms:
GRM5_RAT Grm5 Mglur5 metabotropic glutamate 5/1-C metabotropic glutamate 5a
Type:
Enzyme
Mol. Mass.:
131900.14
Organism:
Rattus norvegicus (Rat)
Description:
P31424
Residue:
1203
  
Inhibitor
Name:
BDBM50345572
Synonyms:
3-(2-(pyridin-2-yl)ethynyl)-5-fluorobenzonitrile | CHEMBL1784618
Type:
Small organic molecule
Emp. Form.:
C14H7FN2
Mol. Mass.:
222.2172
SMILES:
Fc1cc(cc(c1)C#Cc1ccccn1)C#N
: