Target
3-hydroxy-3-methylglutaryl-coenzyme A reductase
Ligand
BDBM18372
Substrate
Meas. Tech.
ChEMBL_750037 (CHEMBL1787314)
IC50
3.1±n/a nM
Citation
 Pfefferkorn, JALitchfield, JHutchings, RCheng, XMLarsen, SDAuerbach, BBush, MRLee, CErasga, NBowles, DMBoyles, DCLu, GSekerke, CAskew, VHanselman, JCDillon, LLin, ZRobertson, AOlsen, KBoustany, CAtkinson, KGoosen, TCSahasrabudhe, VChupka, JDuignan, DBFeng, BScialis, RKimoto, EBi, YALai, YEl-Kattan, ABakker-Arkema, RBarclay, PKindt, ELe, VMandema, JWMilad, MTait, BDKennedy, RTrivedi, BKKowala, M Discovery of novel hepatoselective HMG-CoA reductase inhibitors for treating hypercholesterolemia: a bench-to-bedside case study on tissue selective drug distribution. Bioorg Med Chem Lett 21:2725-31 (2011)  
Target
Name:
3-hydroxy-3-methylglutaryl-coenzyme A reductase
Synonyms:
HMDH_RAT Hmgcr
Type:
Enzyme
Mol. Mass.:
96689.85
Organism:
Rattus norvegicus (rat)
Description:
Isolated rat liver microsomes were used as enzyme source.
Residue:
887
  
Inhibitor
Name:
BDBM18372
Synonyms:
(3R,5S,6E)-7-[4-(4-fluorophenyl)-2-(N-methylmethanesulfonamido)-6-(propan-2-yl)pyrimidin-5-yl]-3,5-dihydroxyhept-6-enoic acid Ros US9102656, Rosuvastatin | ZD4522
Type:
Small organic molecule
Emp. Form.:
C22H28FN3O6S
Mol. Mass.:
481.538
SMILES:
CC(C)c1nc(nc(-c2ccc(F)cc2)c1\C=C\[C@@H](O)C[C@@H](O)CC(O)=O)N(C)S(C)(=O)=O
: