Target
L-cysteine:1D-myo-inositol 2-amino-2-deoxy-alpha-D-glucopyranoside ligase
Ligand
BDBM50347255
Substrate
Meas. Tech.
ChEMBL_754210 (CHEMBL1798854)
IC50
80000±n/a nM
Citation
 Newton, GLBuchmeier, NLa Clair, JJFahey, RC Evaluation of NTF1836 as an inhibitor of the mycothiol biosynthetic enzyme MshC in growing and non-replicating Mycobacterium tuberculosis. Bioorg Med Chem 19:3956-64 (2011)  
Target
Name:
L-cysteine:1D-myo-inositol 2-amino-2-deoxy-alpha-D-glucopyranoside ligase
Synonyms:
L-Cys:GlcN-Ins ligase MSHC_MYCTU cysS2 | mshC
Type:
PROTEIN
Mol. Mass.:
45583.42
Organism:
Mycobacterium tuberculosis
Description:
ChEMBL_754210
Residue:
414
  
Inhibitor
Name:
BDBM50347255
Synonyms:
CHEMBL1796109
Type:
Small organic molecule
Emp. Form.:
C31H34ClN3O3S
Mol. Mass.:
564.138
SMILES:
CCC1CCCCN1CCCNC(=O)c1ccc2c(c1)N(Cc1cccc(Cl)c1)C(=O)c1ccccc1S2=O
: