Target
Beta-3 adrenergic receptor
Ligand
BDBM50296957
Substrate
Meas. Tech.
ChEMBL_756375 (CHEMBL1805401)
EC50
0.160000±n/a nM
Citation
 Congreve, MLangmead, CJMason, JSMarshall, FH Progress in structure based drug design for G protein-coupled receptors. J Med Chem 54:4283-311 (2011)  
Target
Name:
Beta-3 adrenergic receptor
Synonyms:
ADRB3 ADRB3_HUMAN Beta-2 adrenergic receptor and beta-3 adrenergic receptor Beta-3 adrenoreceptor | adrenergic Beta3
Type:
G Protein-Coupled Receptor (GPCR)
Mol. Mass.:
43534.88
Organism:
Homo sapiens (Human)
Description:
Residue:
408
  
Inhibitor
Name:
BDBM50296957
Synonyms:
4'-(2-((1R,2S)-1-hydroxy-1-(4-hydroxyphenyl)propan-2-ylamino)ethyl)-3-isopropoxy-N-(methylsulfonyl)biphenyl-4-carboxamide | CHEMBL551272
Type:
Small organic molecule
Emp. Form.:
C28H34N2O6S
Mol. Mass.:
526.644
SMILES:
CC(C)Oc1cc(ccc1C(=O)NS(C)(=O)=O)-c1ccc(CCN[C@@H](C)[C@H](O)c2ccc(O)cc2)cc1
: