Target
Poly(ADP-ribose) glycohydrolase
Ligand
BDBM50106187
Substrate
Meas. Tech.
ChEMBL_760969 (CHEMBL1814966)
IC50
>1000000±n/a nM
Citation
 Steffen, JDCoyle, DLDamodaran, KBeroza, PJacobson, MK Discovery and structure-activity relationships of modified salicylanilides as cell permeable inhibitors of poly(ADP-ribose) glycohydrolase (PARG). J Med Chem 54:5403-13 (2011)  
Target
Name:
Poly(ADP-ribose) glycohydrolase
Synonyms:
PARG Poly(ADP-ribose) glycohydrolase | poly(ADP-ribose) glycohydrolase (PARG)
Type:
Protein
Mol. Mass.:
111107.13
Organism:
Homo sapiens (Human)
Description:
Q86W56
Residue:
976
  
Inhibitor
Name:
BDBM50106187
Synonyms:
Benzenecarboxamide Benzoylamide Phenylcarboxamide benzamide
Type:
Small organic molecule
Emp. Form.:
C7H7NO
Mol. Mass.:
121.1366
SMILES:
NC(=O)c1ccccc1
: