Target
Kappa-type opioid receptor
Ligand
BDBM50350961
Substrate
Meas. Tech.
ChEMBL_763652 (CHEMBL1820178)
Ki
8.8±n/a nM
Citation
 Verhoest, PRBasak, ASParikh, VHayward, MKauffman, GWParadis, VMcHardy, SFMcLean, SGrimwood, SSchmidt, AWVanase-Frawley, MFreeman, JVan Deusen, JCox, LWong, DLiras, S Design and discovery of a selective small molecule¿ opioid antagonist (2-methyl-N-((2'-(pyrrolidin-1-ylsulfonyl)biphenyl-4-yl)methyl)propan-1-amine, PF-4455242). J Med Chem 54:5868-77 (2011)  
Target
Name:
Kappa-type opioid receptor
Synonyms:
K-OR-1 Kappa-opioid receptor (KOR) Kappa-type opioid receptor (KOR) OPIATE Kappa OPRK1 kappa opioid receptor (KOR)
Type:
G Protein-Coupled Receptor (GPCR)
Mol. Mass.:
42648.76
Organism:
Homo sapiens (Human)
Description:
P41145
Residue:
380
  
Inhibitor
Name:
BDBM50350961
Synonyms:
CHEMBL1818325
Type:
Small organic molecule
Emp. Form.:
C25H33FN2O3S
Mol. Mass.:
460.605
SMILES:
OCCC1CCN(Cc2ccc(cc2F)-c2ccccc2S(=O)(=O)N2CCCCC2)CC1
: