Target
Kappa-type opioid receptor
Ligand
BDBM50350987
Substrate
Meas. Tech.
ChEMBL_763652 (CHEMBL1820178)
Ki
0.500000±n/a nM
Citation
 Verhoest, PRBasak, ASParikh, VHayward, MKauffman, GWParadis, VMcHardy, SFMcLean, SGrimwood, SSchmidt, AWVanase-Frawley, MFreeman, JVan Deusen, JCox, LWong, DLiras, S Design and discovery of a selective small molecule¿ opioid antagonist (2-methyl-N-((2'-(pyrrolidin-1-ylsulfonyl)biphenyl-4-yl)methyl)propan-1-amine, PF-4455242). J Med Chem 54:5868-77 (2011)  
Target
Name:
Kappa-type opioid receptor
Synonyms:
K-OR-1 Kappa-opioid receptor (KOR) Kappa-type opioid receptor (KOR) OPIATE Kappa OPRK1 kappa opioid receptor (KOR)
Type:
G Protein-Coupled Receptor (GPCR)
Mol. Mass.:
42648.76
Organism:
Homo sapiens (Human)
Description:
P41145
Residue:
380
  
Inhibitor
Name:
BDBM50350987
Synonyms:
CHEMBL1818233
Type:
Small organic molecule
Emp. Form.:
C23H30N2O3S
Mol. Mass.:
414.561
SMILES:
CC1(O)CCN(Cc2ccc(cc2)-c2ccccc2S(=O)(=O)N2CCCC2)CC1
: