Target
Prostaglandin G/H synthase 1
Ligand
BDBM50097346
Substrate
Meas. Tech.
ChEMBL_764612 (CHEMBL1821164)
IC50
13200±n/a nM
Citation
 Hieke, MNess, JSteri, RGreiner, CWerz, OSchubert-Zsilavecz, MWeggen, SZettl, H SAR studies of acidic dual¿-secretase/PPAR¿ modulators. Bioorg Med Chem 19:5372-82 (2011)  
Target
Name:
Prostaglandin G/H synthase 1
Synonyms:
COX1 Cyclooxygenase-1 (COX-1) PTGS1 | Prostaglandin G/H synthase (cyclooxygenase)
Type:
Protein
Mol. Mass.:
68868.60
Organism:
Ovis aries (Sheep)
Description:
Residue:
600
  
Inhibitor
Name:
BDBM50097346
Synonyms:
(+/-)-2-(3-chloro-9H-carbazol-7-yl)propanoic acid 2-(6-Chloro-9H-carbazol-2-yl)-propionic acid(carprofen) CARPROFEN Rimadyl | Ro-20-5720/000
Type:
Small organic molecule
Emp. Form.:
C15H12ClNO2
Mol. Mass.:
273.714
SMILES:
CC(C(O)=O)c1ccc2c(c1)[nH]c1ccc(Cl)cc21
: