Target
3-dehydroquinate dehydratase
Ligand
BDBM50303445
Substrate
Meas. Tech.
ChEMBL_766423 (CHEMBL1826563)
Ki
28±n/a nM
Citation
 Tizón, LOtero, JMPrazeres, VFLlamas-Saiz, ALFox, GCvan Raaij, MJLamb, HHawkins, ARAinsa, JACastedo, LGonzález-Bello, C A prodrug approach for improving antituberculosis activity of potent Mycobacterium tuberculosis type II dehydroquinase inhibitors. J Med Chem 54:6063-84 (2011)  
Target
Name:
3-dehydroquinate dehydratase
Synonyms:
AROQ_MYCTU aroQ
Type:
PROTEIN
Mol. Mass.:
15786.25
Organism:
Mycobacterium tuberculosis
Description:
ChEMBL_766423
Residue:
147
  
Inhibitor
Name:
BDBM50303445
Synonyms:
CHEMBL567563 | Sodium(1R,4S,5R)-1,4,5-Trihydroxy-3-(benzo[b]thiophen-2-yl)methoxycyclohexan-1-carboxylate
Type:
Small organic molecule
Emp. Form.:
C16H15O6S
Mol. Mass.:
335.352
SMILES:
O[C@@H]1C[C@@](O)(C=C(OCc2cc3ccccc3s2)[C@H]1O)C([O-])=O
: