Target
cAMP-specific 3',5'-cyclic phosphodiesterase 4A
Ligand
BDBM50353703
Substrate
Meas. Tech.
ChEMBL_769284 (CHEMBL1833211)
IC50
0.3±n/a nM
Citation
 Taltavull, JSerrat, JGràcia, JGavaldà, ACórdoba, MCalama, EMontero, JLAndrés, MMiralpeix, MVilella, DHernández, BBeleta, JRyder, HPagès, L Synthesis and biological activity of pyrido[3',2':4,5]furo[3,2-d]pyrimidine derivatives as novel and potent phosphodiesterase type 4 inhibitors. Eur J Med Chem 46:4946-56 (2011)  
Target
Name:
cAMP-specific 3',5'-cyclic phosphodiesterase 4A
Synonyms:
3',5'-cyclic phosphodiesterase PDE46 PDE4A_HUMAN Phosphodiesterase 4A | Phosphodiesterase 4A (PDE4)
Type:
Enzyme
Mol. Mass.:
98113.27
Organism:
Homo sapiens (Human)
Description:
P27815
Residue:
886
  
Inhibitor
Name:
BDBM50353703
Synonyms:
CHEMBL1830646
Type:
Small organic molecule
Emp. Form.:
C25H34N6O2
Mol. Mass.:
450.5765
SMILES:
CC(C)Nc1nc2oc3c(NCCCN4CCCC4=O)ncnc3c2c2CC(C)(C)CCc12
: