Target
Amine oxidase [flavin-containing] A
Ligand
BDBM15613
Substrate
Meas. Tech.
ChEMBL_769477 (CHEMBL1831417)
IC50
361380±n/a nM
Citation
 Secci, DCarradori, SBolasco, AChimenti, PYáñez, MOrtuso, FAlcaro, S Synthesis and selective human monoamine oxidase inhibition of 3-carbonyl, 3-acyl, and 3-carboxyhydrazido coumarin derivatives. Eur J Med Chem 46:4846-52 (2011)  
Target
Name:
Amine oxidase [flavin-containing] A
Synonyms:
AOFA_HUMAN MAO-A Monoamine oxidase Monoamine oxidase type A (MAO A) Monoamine oxidase type A (MAOA)
Type:
Protein
Mol. Mass.:
59689.53
Organism:
Homo sapiens (Human)
Description:
P21397
Residue:
527
  
Inhibitor
Name:
BDBM15613
Synonyms:
4-chloro-N-(2-morpholin-4-ylethyl)benzamide Aurorix MCL | Moclobemide
Type:
Small organic molecule
Emp. Form.:
C13H17ClN2O2
Mol. Mass.:
268.739
SMILES:
Clc1ccc(cc1)C(=O)NCCN1CCOCC1
: