Target
Kinesin-like protein KIF11
Ligand
BDBM50353820
Substrate
Meas. Tech.
ChEMBL_770426 (CHEMBL1833735)
IC50
5±n/a nM
Citation
 Theoclitou, MEAquila, BBlock, MHBrassil, PJCastriotta, LCode, ECollins, MPDavies, AMDeegan, TEzhuthachan, JFilla, SFreed, EHu, HHuszar, DJayaraman, MLawson, DLewis, PMNadella, MVOza, VPadmanilayam, MPontz, TRonco, LRussell, DWhitston, DZheng, X Discovery of (+)-N-(3-aminopropyl)-N-[1-(5-benzyl-3-methyl-4-oxo-[1,2]thiazolo[5,4-d]pyrimidin-6-yl)-2-methylpropyl]-4-methylbenzamide (AZD4877), a kinesin spindle protein inhibitor and potential anticancer agent. J Med Chem 54:6734-50 (2011)  
Target
Name:
Kinesin-like protein KIF11
Synonyms:
EG5 KIF11_HUMAN Kinesin Spindle Protein Eg5 TRIP5 | kinesin spindle protein
Type:
PROTEIN
Mol. Mass.:
119138.97
Organism:
Homo sapiens (Human)
Description:
ChEMBL_1457426
Residue:
1056
  
Inhibitor
Name:
BDBM50353820
Synonyms:
CHEMBL1829432
Type:
Small organic molecule
Emp. Form.:
C27H31N5O2S
Mol. Mass.:
489.632
SMILES:
CCC(N(CCCN)C(=O)c1ccc(C)cc1)c1nc2c(C)nsc2c(=O)n1Cc1ccccc1
: