Target
Muscarinic acetylcholine receptor M2
Ligand
BDBM50355610
Substrate
Meas. Tech.
ChEMBL_776585 (CHEMBL1913682)
Ki
0.413±n/a nM
Citation
 Glossop, PAWatson, CAPrice, DABunnage, MEMiddleton, DSWood, AJames, KRoberts, DStrang, RSYeadon, MPerros-Huguet, CClarke, NPTrevethick, MAMachin, IStuart, EFEvans, SMHarrison, ACFairman, DAAgoram, BBurrows, JLFeeder, NFulton, CKDillon, BREntwistle, DASpence, FJ Inhalation by design: novel tertiary amine muscarinic M3 receptor antagonists with slow off-rate binding kinetics for inhaled once-daily treatment of chronic obstructive pulmonary disease. J Med Chem 54:6888-904 (2011)  
Target
Name:
Muscarinic acetylcholine receptor M2
Synonyms:
ACM2_HUMAN Cholinergic, muscarinic M2 Muscarinic acetylcholine receptor M2 and M5 | RecName: Full=Muscarinic acetylcholine receptor M2
Type:
GPCR
Mol. Mass.:
51730.61
Organism:
Homo sapiens (Human)
Description:
P08172
Residue:
466
  
Inhibitor
Name:
BDBM50355610
Synonyms:
CHEMBL1237108
Type:
Small organic molecule
Emp. Form.:
C20H30NO3
Mol. Mass.:
332.4566
SMILES:
CC(C)[N+]1(C)C2CCC1CC(C2)OC(=O)C(CO)c1ccccc1
: