Target
Sucrase-isomaltase, intestinal
Ligand
BDBM50327502
Substrate
Meas. Tech.
ChEMBL_775224 (CHEMBL1912578)
Ki
103±n/a nM
Citation
 Eskandari, RJones, KRose, DRPinto, BM Selectivity of 3'-O-methylponkoranol for inhibition of N- and C-terminal maltase glucoamylase and sucrase isomaltase, potential therapeutics for digestive disorders or their sequelae. Bioorg Med Chem Lett 21:6491-4 (2011)  
Target
Name:
Sucrase-isomaltase, intestinal
Synonyms:
Alpha glucosidase SI Sucrase Sucrase-isomaltase, intestinal
Type:
PROTEIN
Mol. Mass.:
209423.23
Organism:
Homo sapiens (Human)
Description:
ChEMBL_1435477
Residue:
1827
  
Inhibitor
Name:
BDBM50327502
Synonyms:
(1R,2R,3S,4S)-3,4-dihydroxy-2-(hydroxymethyl)-1-((2S,3S,4R,5S)-2,3,4,5,6-pentahydroxyhexyl)tetrahydro-1H-thiophenium chloride | CHEMBL1258529
Type:
Small organic molecule
Emp. Form.:
C11H23O8S
Mol. Mass.:
315.36
SMILES:
OC[C@H](O)[C@@H](O)[C@H](O)[C@H](O)C[S@@+]1C[C@@H](O)[C@H](O)[C@H]1CO
: