Target
Appetite-regulating hormone
Ligand
BDBM50359239
Substrate
Meas. Tech.
ChEMBL_790253 (CHEMBL1925646)
Ki
0.38±n/a nM
Citation
 Hoveyda, HRMarsault, EGagnon, RMathieu, APVézina, MLandry, AWang, ZBenakli, KBeaubien, SSaint-Louis, CBrassard, MPinault, JFOuellet, LBhat, SRamaseshan, MPeng, XFoucher, LBeauchemin, SBhérer, PVeber, DFPeterson, MLFraser, GL Optimization of the potency and pharmacokinetic properties of a macrocyclic ghrelin receptor agonist (Part I): Development of ulimorelin (TZP-101) from hit to clinic. J Med Chem 54:8305-20 (2011)  
Target
Name:
Appetite-regulating hormone
Synonyms:
GHRL Ghrelin Ghrelin-28 Growth hormone-releasing peptide Motilin-related peptide Protein M46
Type:
PROTEIN
Mol. Mass.:
12908.57
Organism:
Homo sapiens (Human)
Description:
ChEMBL_790253
Residue:
117
  
Inhibitor
Name:
BDBM50359239
Synonyms:
CHEMBL1923629
Type:
Small organic molecule
Emp. Form.:
C33H45FN4O4
Mol. Mass.:
580.7332
SMILES:
C[C@@H]1CN[C@@H](C2CCCCC2)C(=O)N(C)[C@H](C)C(=O)N[C@H](Cc2ccc(F)cc2)C(=O)NCCCc2ccccc2O1
: