Target
Adenosine receptor A2a
Ligand
BDBM50360185
Substrate
Meas. Tech.
ChEMBL_794131 (CHEMBL1931869)
Ki
270±n/a nM
Citation
 Federico, SPaoletta, SCheong, SLPastorin, GCacciari, BStragliotto, SKlotz, KNSiegel, JGao, ZGJacobson, KAMoro, SSpalluto, G Synthesis and Biological Evaluation of a New Series of 1,2,4-Triazolo[1,5-a]-1,3,5-triazines as Human A(2A) Adenosine Receptor Antagonists with Improved Water Solubility. J Med Chem 54:877-89 (2011)  
Target
Name:
Adenosine receptor A2a
Synonyms:
A2A adenosine receptor (hA2A) ADENOSINE A2 ADORA2 Adenosine A2A receptor (A2AAR)
Type:
G Protein-Coupled Receptor (GPCR)
Mol. Mass.:
44716.46
Organism:
Homo sapiens (Human)
Description:
P29274
Residue:
412
  
Inhibitor
Name:
BDBM50360185
Synonyms:
CHEMBL1927445
Type:
Small organic molecule
Emp. Form.:
C11H15N8O
Mol. Mass.:
275.2893
SMILES:
Nc1nc(NCCC[NH3+])nc2nc(nn12)-c1ccco1
: