Target
2-dehydro-3-deoxyphosphooctonate aldolase
Ligand
BDBM50281349
Substrate
Meas. Tech.
ChEMBL_797884 (CHEMBL1942571)
Ki
260000±n/a nM
Citation
 Harrison, ANReichau, SParker, EJ Synthesis and evaluation of tetrahedral intermediate mimic inhibitors of 3-deoxy-d-manno-octulosonate 8-phosphate synthase. Bioorg Med Chem Lett 22:907-11 (2012)  
Target
Name:
2-dehydro-3-deoxyphosphooctonate aldolase
Synonyms:
3-deoxy-D-manno-octulosonic acid 8-phosphate synthase KDO-8-phosphate synthase KDSA_NEIMB kdsA
Type:
PROTEIN
Mol. Mass.:
30484.01
Organism:
Neisseria meningitidis serogroup B (strain MC58)
Description:
ChEMBL_797884
Residue:
280
  
Inhibitor
Name:
BDBM50281349
Synonyms:
CHEMBL95764 glyphosate
Type:
Small organic molecule
Emp. Form.:
C3H8NO5P
Mol. Mass.:
169.0731
SMILES:
OC(=O)CNCP(O)(O)=O
: