Target
Glycogen phosphorylase, muscle form
Ligand
BDBM50240802
Substrate
Meas. Tech.
ChEMBL_802298 (CHEMBL1949456)
pH
6.8±n/a
Ki
32000±n/a nM
Comments
extracted
Citation
 Nagy, VFelföldi, NKónya, BPraly, JPDocsa, TGergely, PChrysina, EDTiraidis, CKosmopoulou, MNAlexacou, KMKonstantakaki, MLeonidas, DDZographos, SEOikonomakos, NGKozmon, STvaroška, ISomsák, L N-(4-Substituted-benzoyl)-N'-(ß-d-glucopyranosyl)ureas as inhibitors of glycogen phosphorylase: Synthesis and evaluation by kinetic, crystallographic, and molecular modelling methods. Bioorg Med Chem 20:1801-16 (2012)  
Target
Name:
Glycogen phosphorylase, muscle form
Synonyms:
Glycogen Phosphorylase (PYGM) Glycogen phosphorylase, muscle form PYGM | PYGM_RABIT
Type:
Enzyme
Mol. Mass.:
97296.32
Organism:
Oryctolagus cuniculus (rabbit)
Description:
Phosphorylation of Ser-15 converts phosphorylase B (unphosphorylated) to phosphorylase A.
Residue:
843
  
Inhibitor
Name:
BDBM50240802
Synonyms:
1-N-ACETYL-BETA-D-GLUCOSAMINE N-((2R,3R,4S,5S,6R)-3,4,5-trihydroxy-6-(hydroxymethyl)tetrahydro-2H-pyran-2-yl)acetamide N-acetyl-b-D-glucopyranosylamine | N-acetyl-beta-D-glucopyranosylamine
Type:
Small organic molecule
Emp. Form.:
C8H15NO6
Mol. Mass.:
221.2078
SMILES:
CC(=O)N[C@@H]1O[C@H](CO)[C@@H](O)[C@H](O)[C@H]1O
: