Target
Neuronal acetylcholine receptor subunit alpha-7
Ligand
BDBM50364879
Substrate
Meas. Tech.
ChEMBL_803919 (CHEMBL1954606)
Ki
0.28±n/a nM
Citation
 Schrimpf, MRSippy, KBBriggs, CAAnderson, DJLi, TJi, JFrost, JMSurowy, CSBunnelle, WHGopalakrishnan, MMeyer, MD SAR ofa7 nicotinic receptor agonists derived from tilorone: exploration of a novel nicotinic pharmacophore. Bioorg Med Chem Lett 22:1633-8 (2012)  
Target
Name:
Neuronal acetylcholine receptor subunit alpha-7
Synonyms:
ACHA7_RAT Cholinergic, Nicotinic Alpha7 Chrna7 Neuronal acetylcholine receptor (alpha7 nAChR) Neuronal acetylcholine receptor subunit alpha-7 Neuronal acetylcholine receptor subunit alpha-7 (nAChR)
Type:
Enzyme
Mol. Mass.:
56502.44
Organism:
Rattus norvegicus (Rat)
Description:
Q05941
Residue:
502
  
Inhibitor
Name:
BDBM50364879
Synonyms:
CHEMBL1950160
Type:
Small organic molecule
Emp. Form.:
C20H20N2O
Mol. Mass.:
304.3856
SMILES:
O=C1c2ccccc2-c2ccc(cc12)N1CCN2CCC1CC2
: