Target
Adenosine receptor A2a/A2b
Ligand
BDBM14487
Substrate
Meas. Tech.
ChEMBL_30560 (CHEMBL649872)
Ki
37±n/a nM
Citation
 Nair, VFesbender, AJMiller, LPBruce, JL High selectivity of novel isoguanosine analogues for the adenosine A1 receptor Bioorg Med Chem Lett 1:481-486 (1991)    Article 
Target
Name:
Adenosine receptor A2a/A2b
Synonyms:
Adenosine A2 receptor
Type:
Mol. Mass.:
Description:
ASSAY_ID of ChEMBL is 30560
Components:
This complex has 2 components.
Component 1
Name:
Adenosine receptor A2b
Synonyms:
AA2BR_RAT Adora2b
Type:
PROTEIN
Mol. Mass.:
36378.84
Organism:
Rattus norvegicus
Description:
ChEMBL_32934
Residue:
332
  
Component 2
Name:
Adenosine receptor A2a
Synonyms:
AA2AR_RAT Adenosine A2 receptor Adenosine Receptors A2a (A2a) Adenosine receptors A2a Rat striatal adenosine A2a receptor
Type:
G Protein-Coupled Receptor (GPCR)
Mol. Mass.:
45015.65
Organism:
Rattus norvegicus (rat)
Description:
Rat A2A receptors expressed in CHO cells.
Residue:
410
  
Inhibitor
Name:
BDBM14487
Synonyms:
(2R,3R,4S,5R)-2-(6-amino-9H-purin-9-yl)-5-(hydroxymethyl)oxolane-3,4-diol Adenosine N6-Methylado cid_191 | cid_60961
Type:
Nucleoside or nucleotide
Emp. Form.:
C10H13N5O4
Mol. Mass.:
267.2413
SMILES:
Nc1ncnc2n(cnc12)[C@@H]1O[C@H](CO)[C@@H](O)[C@H]1O
: