Target
Gastrin/cholecystokinin type B receptor
Ligand
BDBM50027065
Substrate
Meas. Tech.
ChEBML_40195
IC50
17000±n/a nM
Citation
 Kendrick, DARyder, HSemple, GSzelke, M Cholecystokinin analogues: The ergopeptine alkaloids as models of the active conformation of CCK Bioorg Med Chem Lett 2:9-12 (1992)    Article 
Target
Name:
Gastrin/cholecystokinin type B receptor
Synonyms:
Cckbr Cholecystokinin receptor Gastrin/cholecystokinin type B receptor
Type:
Enzyme Catalytic Domain
Mol. Mass.:
49196.59
Organism:
MOUSE
Description:
Cholecystokinin A CCKBR MOUSE::P56481
Residue:
453
  
Inhibitor
Name:
BDBM50027065
Synonyms:
(5'alpha)-12'-hydroxy-2'-methyl-5'-(phenylmethyl)ergotoman-3',6',18-trione 12'-hydroxy-2'-methyl-5'alpha-(phenylmethyl)ergotaman-3',6',18-trione Ergotamin
Type:
Small organic molecule
Emp. Form.:
C33H35N5O5
Mol. Mass.:
581.6615
SMILES:
CN1C[C@@H](C=C2[C@H]1Cc1c[nH]c3cccc2c13)C(=O)N[C@]1(C)O[C@@]2(O)[C@@H]3CCCN3C(=O)[C@H](Cc3ccccc3)N2C1=O
: