Target
3-phosphoshikimate 1-carboxyvinyltransferase
Ligand
BDBM50283580
Substrate
Meas. Tech.
ChEMBL_64948 (CHEMBL675693)
IC50
3000000±n/a nM
Citation
 Miller, MJBraccolino, DSClearly, DGReam, JEWalker, MCSikorski, JA EPSP synthase inhibitor design IV. New aromatic substrate analogs and symmetrical inhibitors containing novel 3-phosphate mimics. Bioorg Med Chem Lett 4:2605-2608 (1994)    Article 
Target
Name:
3-phosphoshikimate 1-carboxyvinyltransferase
Synonyms:
5-enolpyruvylshikimate-3-phosphate synthase aroA
Type:
PROTEIN
Mol. Mass.:
46089.22
Organism:
Escherichia coli (strain K12)
Description:
ChEMBL_65087
Residue:
427
  
Inhibitor
Name:
BDBM50283580
Synonyms:
CHEMBL432180 | Tri-Sodium; 3-carboxymethoxy-5-(hydroxy-phosphonomethyl)-benzoate
Type:
Small organic molecule
Emp. Form.:
C10H8O9P
Mol. Mass.:
303.1405
SMILES:
OP(O)([O-])C(=O)c1cc(OCC([O-])=O)cc(c1)C([O-])=O
: