Target
Protein tyrosine phosphatase receptor type C-associated protein
Ligand
BDBM50197829
Substrate
Meas. Tech.
ChEBML_210870
IC50
88000±n/a nM
Citation
 Miski, MXing, ShenCooper, RGillum, AMFisher, DKMiller, RWHiggins, TJ Aporphine alkaloids, CD45 protein tyrosine phosphatase inhibitors, from Rollinia ulei Bioorg Med Chem Lett 5:1519-1522 (1995)    Article 
Target
Name:
Protein tyrosine phosphatase receptor type C-associated protein
Synonyms:
CD45-AP LPAP PTCA_HUMAN PTPRCAP
Type:
PROTEIN
Mol. Mass.:
21182.08
Organism:
Homo sapiens (Human)
Description:
ChEMBL_210870
Residue:
206
  
Inhibitor
Name:
BDBM50197829
Synonyms:
(S)-1,2,9,10-tetramethoxy-6-methyl-5,6,6a,7-tetrahydro-4H-dibenzo[de,g]quinoline GLAUCINE | glaucine fumarate
Type:
Small organic molecule
Emp. Form.:
C21H25NO4
Mol. Mass.:
355.4275
SMILES:
COc1cc2C[C@@H]3N(C)CCc4cc(OC)c(OC)c(-c2cc1OC)c34
: