Target
Lysosomal alpha-glucosidase
Ligand
BDBM50285810
Substrate
Meas. Tech.
ChEBML_37554
Ki
700000±n/a nM
Citation
 Bleriot, YDintinger, TGenre-Grandpierre, APadrines, MTellier, C Inhibition of glycosidases by substituted amidines Bioorg Med Chem Lett 5:2655-2660 (1995)    Article 
Target
Name:
Lysosomal alpha-glucosidase
Synonyms:
70 kDa lysosomal alpha-glucosidase Acid maltase Alpha glucosidase LYAG_HUMAN
Type:
PROTEIN
Mol. Mass.:
105312.45
Organism:
Homo sapiens (Human)
Description:
ChEMBL_1506060
Residue:
952
  
Inhibitor
Name:
BDBM50285810
Synonyms:
6-benzylamino-2,3,4,5-tetrahydro-2-pyridiniumylmethanol
Type:
Small organic molecule
Emp. Form.:
C13H19N2O
Mol. Mass.:
219.3022
SMILES:
OCC1CCCC(NCc2ccccc2)=[NH+]1
: