Target
5-hydroxytryptamine receptor 3A/3B
Ligand
BDBM50083197
Substrate
Meas. Tech.
ChEMBL_3139 (CHEMBL617981)
Ki
0.290000±n/a nM
Citation
 Lopez-Rodriguez, MLMorcillo, MJBenhamu, BRiaguas, MD Novel benzimidazole-4-carboxylic acid derivatives as potent and selective 5-HT3 receptor ligands Bioorg Med Chem Lett 6:1195-1198 (1996)    Article 
Target
Name:
5-hydroxytryptamine receptor 3A/3B
Synonyms:
Serotonin 3 (5-HT3) receptor | Serotonin 3a (5-HT3a)/3b (5-HT3b) receptor
Type:
Mol. Mass.:
Description:
ASSAY_ID of EBI is 2974
Components:
This complex has 2 components.
Component 1
Name:
5-hydroxytryptamine receptor 3B
Synonyms:
5HT3B_RAT Serotonin (5-HT) receptor
Type:
PROTEIN
Mol. Mass.:
50328.78
Organism:
Rattus norvegicus
Description:
EBI_11885
Residue:
437
  
Component 2
Name:
5-hydroxytryptamine receptor 3A
Synonyms:
5-HT3 5HT3A_RAT Htr3 Serotonin (5-HT) receptor | Zacopride site-R
Type:
Enzyme Catalytic Domain
Mol. Mass.:
55428.70
Organism:
RAT
Description:
5-HT3 HTR3A RAT::P35563
Residue:
483
  
Inhibitor
Name:
BDBM50083197
Synonyms:
6-Chloro-1H-benzoimidazole-4-carboxylic acid (1-aza-bicyclo[2.2.2]oct-3-yl)-amide | CHEMBL19006
Type:
Small organic molecule
Emp. Form.:
C15H17ClN4O
Mol. Mass.:
304.775
SMILES:
Clc1cc(C(=O)NC2CN3CCC2CC3)c2[nH]cnc2c1
: