Target
3-phosphoshikimate 1-carboxyvinyltransferase
Ligand
BDBM50280242
Substrate
Meas. Tech.
ChEMBL_64955 (CHEMBL675698)
Kd
7000±n/a nM
Citation
 Peterson, MLCorey, SDFont, JLWalker, MCSikorski, JA New simplified inhibitors of EPSP synthase: The importance of ring size for recognition at the shikimate 3-phosphate site Bioorg Med Chem Lett 6:2853-2858 (1996)    Article 
Target
Name:
3-phosphoshikimate 1-carboxyvinyltransferase
Synonyms:
5-enolpyruvylshikimate-3-phosphate synthase aroA
Type:
PROTEIN
Mol. Mass.:
46089.22
Organism:
Escherichia coli (strain K12)
Description:
ChEMBL_65087
Residue:
427
  
Inhibitor
Name:
BDBM50280242
Synonyms:
(3R,4S,5R)-4,5-Dihydroxy-3-phosphonooxy-cyclohex-1-enecarboxylic acid 3-phosphoshikimate
Type:
Small organic molecule
Emp. Form.:
C7H8O8P
Mol. Mass.:
251.109
SMILES:
O[C@@H]1CC(=C[C@@H](OP([O-])([O-])=O)[C@H]1O)C([O-])=O
: