Target
Angiotensin-converting enzyme
Ligand
BDBM50071319
Substrate
Meas. Tech.
ChEBML_34782
IC50
6.6±n/a nM
Citation
 Hanessian, SReinhold, USaulnier, MClaridge, S Probing the importance of spacial and conformational domains in captopril analogs for angiotensin converting enzyme activity. Bioorg Med Chem Lett 8:2123-8 (1999)  
Target
Name:
Angiotensin-converting enzyme
Synonyms:
3.2.1.- ACE Angiotensin-converting enzyme, soluble form DCP1 Kininase II
Type:
Mol. Mass.:
150405.15
Organism:
Oryctolagus cuniculus
Description:
Residue:
1310
  
Inhibitor
Name:
BDBM50071319
Synonyms:
(1S,3S,5S)-2-((S)-3-Mercapto-2-methyl-propionyl)-2-aza-bicyclo[3.1.0]hexane-3-carboxylic acid | CHEMBL68068
Type:
Small organic molecule
Emp. Form.:
C10H15NO3S
Mol. Mass.:
229.296
SMILES:
C[C@H](CS)C(=O)N1[C@H]2C[C@H]2C[C@H]1C(O)=O
: