Target
D(2) dopamine receptor
Ligand
BDBM85330
Substrate
Meas. Tech.
ChEBML_58472
IC50
>1000±n/a nM
Citation
 Hirokawa, YMorie, TYamazaki, HYoshida, NKato, S A novel series of N-(hexahydro-1,4-diazepin-6-yl) and N-(hexahydroazepin- 3-yl)benzamides with high affinity for 5-HT3 and dopamine D2 receptors. Bioorg Med Chem Lett 8:619-24 (1999)  
Target
Name:
D(2) dopamine receptor
Synonyms:
DOPAMINE D2 DOPAMINE D2 Short Dopamine D2 receptor Drd2
Type:
G Protein-Coupled Receptor (GPCR)
Mol. Mass.:
50931.60
Organism:
Rattus norvegicus (rat)
Description:
P61169
Residue:
444
  
Inhibitor
Name:
BDBM85330
Synonyms:
CAS_68647 ONDANSETRON | Ondansetron hydrochloride
Type:
Small organic molecule
Emp. Form.:
C18H19N3O
Mol. Mass.:
293.363
SMILES:
Cc1nccn1CC1CCc2c(C1=O)c1ccccc1n2C
: