Target
Nociceptin receptor
Ligand
BDBM50087695
Substrate
Meas. Tech.
ChEBML_146124
Ki
25±n/a nM
Citation
 Röver, SWichmann, JJenck, FAdam, GCesura, AM ORL1 receptor ligands: structure-activity relationships of 8-cycloalkyl-1-phenyl-1,3,8-triaza-spiro[4.5]decan-4-ones. Bioorg Med Chem Lett 10:831-4 (2000)  
Target
Name:
Nociceptin receptor
Synonyms:
Nociceptin/Orphanin FQ, NOP receptor OPRX_RAT Oprl | Oprl1
Type:
Enzyme Catalytic Domain
Mol. Mass.:
40531.08
Organism:
RAT
Description:
Nociceptin/Orphanin FQ, NOP receptor 0 RAT::P35370
Residue:
367
  
Inhibitor
Name:
BDBM50087695
Synonyms:
8-Cyclohexyl-1-phenyl-1,3,8-triaza-spiro[4.5]decan-4-one | CHEMBL263575
Type:
Small organic molecule
Emp. Form.:
C19H27N3O
Mol. Mass.:
313.4372
SMILES:
O=C1NCN(c2ccccc2)C11CCN(CC1)C1CCCCC1
: