Target
Acetylcholinesterase
Ligand
BDBM50117574
Substrate
Meas. Tech.
ChEMBL_70883 (CHEMBL684541)
EC50
430±n/a nM
Citation
 Clark, JKCowley, PMuir, AWPalin, RPow, EProsser, ABTaylor, RZhang, MQ Quaternary salts of E2020 analogues as acetylcholinesterase inhibitors for the reversal of neuromuscular block. Bioorg Med Chem Lett 12:2565-8 (2002)  
Target
Name:
Acetylcholinesterase
Synonyms:
ACES_HUMAN Acetylcholinesterase (AChE) | Acetylcholinesterase (human AChE)
Type:
Enzyme
Mol. Mass.:
67792.70
Organism:
Homo sapiens (Human)
Description:
P22303
Residue:
614
  
Inhibitor
Name:
BDBM50117574
Synonyms:
1-Benzyl-1-methyl-4-[3-(5-methyl-1-phenyl-1H-pyrazol-3-yl)-3-oxo-propyl]-piperidinium CHEMBL87014
Type:
Small organic molecule
Emp. Form.:
C26H32N3O
Mol. Mass.:
402.5512
SMILES:
Cc1cc(nn1-c1ccccc1)C(=O)CCC1CC[N+](C)(Cc2ccccc2)CC1
: