Target
Reverse transcriptase/RNaseH
Ligand
BDBM50366816
Substrate
Meas. Tech.
ChEMBL_197276 (CHEMBL804263)
EC50
5300±n/a nM
Citation
 Choo, HChong, YChu, CK The role of 2',3'-unsaturation on the antiviral activity of anti-HIV nucleosides against 3TC-resistant mutant (M184V). Bioorg Med Chem Lett 13:1993-6 (2003)  
Target
Name:
Reverse transcriptase/RNaseH
Synonyms:
HIV-1 Reverse Transcriptase RNase H Reverse transcriptase/RNaseH
Type:
PROTEIN
Mol. Mass.:
65229.15
Organism:
Human immunodeficiency virus 1
Description:
ChEMBL_1473730
Residue:
566
  
Inhibitor
Name:
BDBM50366816
Synonyms:
ABACAVIR Ziagen
Type:
Small organic molecule
Emp. Form.:
C14H18N6O
Mol. Mass.:
286.3323
SMILES:
Nc1nc(NC2CC2)c2ncn([C@@H]3C[C@H](CO)C=C3)c2n1
: