Target
Beta-secretase 1
Ligand
BDBM16047
Substrate
Meas. Tech.
ChEMBL_41377 (CHEMBL653500)
Ki
1.6±n/a nM
Citation
 Hu, JCwi, CLSmiley, DLTimm, DErickson, JAMcGee, JEYang, HCMendel, DMay, PCShapiro, MMcCarthy, JR Design and synthesis of statine-containing BACE inhibitors. Bioorg Med Chem Lett 13:4335-9 (2003)  
Target
Name:
Beta-secretase 1
Synonyms:
ASP2 Aspartyl protease 2 BACE1 Beta-secretase (BACE) Beta-secretase 1 (BACE 1) Beta-secretase 1 (BACE1) Beta-site amyloid precursor protein cleaving enzyme 1 Memapsin-2 beta-Secretase (BACE-1) | beta-Secretase (BACE1)
Type:
Protein
Mol. Mass.:
55755.10
Organism:
Homo sapiens (Human)
Description:
P56817
Residue:
501
  
Inhibitor
Name:
BDBM16047
Synonyms:
(4S)-4-[(2S)-2-[(2R,4S,5S)-5-[(2S)-2-[(2S)-2-[(4S)-4-amino-4-formamidobutanoic acid]-3-methylbutanamido]butanediamido]-4-hydroxy-2,7-dimethyloctanamido]propanamido]-4-{[(1S)-1-carboxy-2-phenylethyl]carbamoyl}butanoic acid EVNXXAEF OM99-2
Type:
polypeptide
Emp. Form.:
C41H64N8O14
Mol. Mass.:
892.9921
SMILES:
CC(C)C[C@H](NC(=O)[C@H](CC(N)=O)NC(=O)[C@@H](NC(=O)[C@@H](N)CCC(O)=O)C(C)C)[C@@H](O)C[C@@H](C)C(=O)N[C@@H](C)C(=O)N[C@@H](CCC(O)=O)C(=O)N[C@@H](Cc1ccccc1)C(O)=O
: