Target
Adenosine receptor A2a
Ligand
BDBM50080398
Substrate
Meas. Tech.
ChEBML_75662
Ki
130±n/a nM
Citation
 Daly, JW Adenosine receptors: targets for future drugs. J Med Chem 25:197-207 (1982)  
Target
Name:
Adenosine receptor A2a
Synonyms:
AA2AR_CAVPO ADORA2A | Adenosine A2a receptor
Type:
Enzyme Catalytic Domain
Mol. Mass.:
44955.08
Organism:
GUINEA PIG
Description:
ADENOSINE A2 0 GUINEA PIG::P46616
Residue:
409
  
Inhibitor
Name:
BDBM50080398
Synonyms:
(2R,3S,4R,5R)-2-Hydroxymethyl-5-[6-((S)-1-methyl-2-phenyl-ethylamino)-purin-9-yl]-tetrahydro-furan-3,4-diol CHEMBL420705 | N6-[(S)-1-Methyl-2-phenylethyl]ado (S-PIA)
Type:
Small organic molecule
Emp. Form.:
C19H23N5O4
Mol. Mass.:
385.417
SMILES:
C[C@@H](Cc1ccccc1)Nc1ncnc2n(cnc12)[C@@H]1O[C@H](CO)[C@@H](O)[C@H]1O
: