Target
GTP:AMP phosphotransferase AK3, mitochondrial
Ligand
BDBM50367102
Substrate
Meas. Tech.
ChEMBL_32216 (CHEMBL649601)
Ki
12400000±n/a nM
Citation
 Hai, TTPicker, DAbo, MHampton, A Species- or isozyme-specific enzyme inhibitors. 7. Selective effects in inhibitions of rat adenylate kinase isozymes by adenosine 5'-phosphate derivatives. J Med Chem 25:806-12 (1982)  
Target
Name:
GTP:AMP phosphotransferase AK3, mitochondrial
Synonyms:
AK 3 Adenylate kinase 3 alpha like 1 Ak3 Akl3l KAD3_RAT
Type:
PROTEIN
Mol. Mass.:
25443.58
Organism:
Rattus norvegicus
Description:
ChEMBL_1340551
Residue:
227
  
Inhibitor
Name:
BDBM50367102
Synonyms:
CHEMBL608353
Type:
Small organic molecule
Emp. Form.:
C14H21N6O8P
Mol. Mass.:
432.3257
SMILES:
CC(=O)NCCNc1ncnc2n(cnc12)C1O[C@H](COP(O)(O)=O)[C@@H](O)[C@H]1O
: