Target
D(2) dopamine receptor
Ligand
BDBM81774
Substrate
Meas. Tech.
ChEMBL_59783 (CHEMBL671743)
IC50
0.000±n/a nM
Citation
 Neumeyer, JLGuan, JHNiznik, HBDumbrille-Ross, ASeeman, PPadmanabhan, SElmaleh, DR Novel photoaffinity label for the dopamine D2 receptor: synthesis of 4-azido-5-iodo-2-methoxy-N-[1-(phenylmethyl)-4-piperidinyl] benzamide (iodoazidoclebopride, IAC) and the corresponding 125I-labeled analogue (125IAC). J Med Chem 28:405-7 (1985)  
Target
Name:
D(2) dopamine receptor
Synonyms:
D(2) dopamine receptor DOPAMINE D2 Long DRD2 Dopamine D2 receptor Dopamine D2 receptor (D2R) Dopamine2-like | d2
Type:
Cell-surface receptors
Mol. Mass.:
50647.10
Organism:
Homo sapiens (Human)
Description:
P14416
Residue:
443
  
Inhibitor
Name:
BDBM81774
Synonyms:
CAS_15676-16-1 Sulpiride-S | Sulpiride-l
Type:
Emp. Form.:
C15H23N3O4S
Mol. Mass.:
341.426
SMILES:
CCN1CCC[C@H]1CNC(=O)c1cc(ccc1OC)S(N)(=O)=O
: