Target
D(2) dopamine receptor
Ligand
BDBM50029051
Substrate
Meas. Tech.
ChEBML_59783
IC50
0.000±n/a nM
Citation
 Neumeyer, JLGuan, JHNiznik, HBDumbrille-Ross, ASeeman, PPadmanabhan, SElmaleh, DR Novel photoaffinity label for the dopamine D2 receptor: synthesis of 4-azido-5-iodo-2-methoxy-N-[1-(phenylmethyl)-4-piperidinyl] benzamide (iodoazidoclebopride, IAC) and the corresponding 125I-labeled analogue (125IAC). J Med Chem 28:405-7 (1985)  
Target
Name:
D(2) dopamine receptor
Synonyms:
D(2) dopamine receptor DOPAMINE D2 Long DRD2 Dopamine D2 receptor Dopamine D2 receptor (D2R) Dopamine2-like | d2
Type:
Cell-surface receptors
Mol. Mass.:
50647.10
Organism:
Homo sapiens (Human)
Description:
P14416
Residue:
443
  
Inhibitor
Name:
BDBM50029051
Synonyms:
(-)-arterenol (-)-norepinephrine (R)-4-(2-amino-1-hydroxyethyl)-1,2-benzenediol (R)-norepinephrine CHEMBL1437 | NOREPINEPHRINE
Type:
Small organic molecule
Emp. Form.:
C8H11NO3
Mol. Mass.:
169.1778
SMILES:
NC[C@H](O)c1ccc(O)c(O)c1
: